Reaction Details
TargetGuanine nucleotide-binding protein G(o) subunit alpha
LigandBDBM50174661
Substrate/Competitorn/a
Meas. Tech.ChEMBL_321106 (CHEMBL882872)
EC50 12400±n/a nM
Citation Manetti, DDi Cesare Mannelli, LDei, SGaleotti, NGhelardini, CRomanelli, MNScapecchi, STeodori, EPacini, ABartolini, AGualtieri, F Design, synthesis, and preliminary pharmacological evaluation of a set of small molecules that directly activate gi proteins. J Med Chem48:6491-503 (2005) 
 
Guanine nucleotide-binding protein G(o) subunit alpha
Name:Guanine nucleotide-binding protein G(o) subunit alpha
Type:PROTEIN
Mol. Mass.:40043.59
Organism:Homo sapiens (Human)
Description:ChEMBL_321106
Residue:354
BDBM50174661
NameBDBM50174661
Synonyms:CHEMBL535827 | Pentadecyl-piperidin-4-ylmethyl-amine; dihydrochloride
TypeSmall organic molecule
Emp. Form.C21H44N2
Mol. Mass.324.5875
1CCNCC1