Reaction Details
TargetGuanine nucleotide-binding protein G(i) subunit alpha-3
LigandBDBM50174665
Substrate/Competitorn/a
Meas. Tech.ChEMBL_321105 (CHEMBL882871)
EC50 23000±n/a nM
Citation Manetti, DDi Cesare Mannelli, LDei, SGaleotti, NGhelardini, CRomanelli, MNScapecchi, STeodori, EPacini, ABartolini, AGualtieri, F Design, synthesis, and preliminary pharmacological evaluation of a set of small molecules that directly activate gi proteins. J Med Chem48:6491-503 (2005) 
 
Guanine nucleotide-binding protein G(i) subunit alpha-3
Name:Guanine nucleotide-binding protein G(i) subunit alpha-3
Type:PROTEIN
Mol. Mass.:40527.21
Organism:Homo sapiens (Human)
Description:ChEMBL_321105
Residue:354
BDBM50174665
NameBDBM50174665
Synonyms:CHEMBL541892 | [1-(2-Amino-ethyl)-piperidin-4-ylmethyl]-pentadecyl-amine; trihydrochloride
TypeSmall organic molecule
Emp. Form.C23H49N3
Mol. Mass.367.6553
1CCN(CCN)CC1