Reaction Details
Target5-hydroxytryptamine receptor 1A
LigandBDBM50108392
Substrate/Competitorn/a
Meas. Tech.ChEMBL_320761 (CHEMBL884575)
Ki 5.3±n/a nM
Citation Morphy, RRankovic, Z Designed multiple ligands. An emerging drug discovery paradigm. J Med Chem48:6523-43 (2005) 
 
5-hydroxytryptamine receptor 1A
Name:5-hydroxytryptamine receptor 1A
Type:n/a
Mol. Mass.:46122.49
Organism:Homo sapiens (Human)
Description:n/a
Residue:422
BDBM50108392
NameBDBM50108392
Synonyms:(3-ENDO)-8-METHYL-8-AZABICYCLO[3.2.1]OCT-3-YL 1H-INDOLE-3-CARBOXYLATE | CHEMBL56564
TypeSmall organic molecule
Emp. Form.C17H20N2O2
Mol. Mass.284.3529
SMILESCN1[C@H]2CC[C@@H]1C[C@@H](C2)OC(=O)c1c[nH]c2ccccc12