Reaction Details
Target5-hydroxytryptamine receptor 1A
LigandBDBM50027183
Substrate/Competitorn/a
Meas. Tech.ChEMBL_320761 (CHEMBL884575)
Ki 24±n/a nM
Citation Morphy, RRankovic, Z Designed multiple ligands. An emerging drug discovery paradigm. J Med Chem48:6523-43 (2005) 
 
5-hydroxytryptamine receptor 1A
Name:5-hydroxytryptamine receptor 1A
Type:n/a
Mol. Mass.:46122.49
Organism:Homo sapiens (Human)
Description:n/a
Residue:422
BDBM50027183
NameBDBM50027183
Synonyms:CHEMBL326134
TypeSmall organic molecule
Emp. Form.C13H18N2O2
Mol. Mass.234.2942
SMILESCN(C)CC(O)COc1cccc2[nH]ccc12