Reaction Details
TargetAngiotensin-converting enzyme
LigandBDBM50115848
Substrate/Competitorn/a
Meas. Tech.ChEMBL_320763 (CHEMBL884718)
Ki 1.3±n/a nM
Citation Morphy, RRankovic, Z Designed multiple ligands. An emerging drug discovery paradigm. J Med Chem48:6523-43 (2005) 
 
Angiotensin-converting enzyme
Name:Angiotensin-converting enzyme
Type:Enzyme
Mol. Mass.:149709.01
Organism:Homo sapiens (Human)
Description:n/a
Residue:1306
BDBM50115848
NameBDBM50115848
Synonyms:(S)-3-(1H-Indol-3-yl)-2-[(R)-3-mercapto-2-((S)-5-methoxy-indan-1-yl)-propionylamino]-propionic acid | CHEMBL305388
TypeSmall organic molecule
Emp. Form.C24H26N2O4S
Mol. Mass.438.539
SMILESCOc1ccc2[C@@H](CCc2c1)[C@@H](CS)C(=O)N[C@@H](Cc1c[nH]c2ccccc12)C(O)=O