Reaction Details
TargetBeta-2 adrenergic receptor
LigandBDBM50027185
Substrate/Competitorn/a
Meas. Tech.ChEMBL_321064 (CHEMBL872147)
Ki 0.63±n/a nM
Citation Morphy, RRankovic, Z Designed multiple ligands. An emerging drug discovery paradigm. J Med Chem48:6523-43 (2005) 
 
Beta-2 adrenergic receptor
Name:Beta-2 adrenergic receptor
Type:n/a
Mol. Mass.:46461.69
Organism:Homo sapiens (Human)
Description:P07550
Residue:413
BDBM50027185
NameBDBM50027185
Synonyms:CHEMBL183921
TypeSmall organic molecule
Emp. Form.C22H25N3O5
Mol. Mass.411.451
SMILESCC(COc1ccc2OCC(=O)Nc2c1)NCC(O)COc1cccc2[nH]ccc12