Reaction Details
TargetPeroxisome proliferator-activated receptor gamma
LigandBDBM50122340
Substrate/Competitorn/a
Meas. Tech.ChEMBL_320735 (CHEMBL881208)
Kd 2700±n/a nM
Citation Morphy, RRankovic, Z Designed multiple ligands. An emerging drug discovery paradigm. J Med Chem48:6523-43 (2005) 
 
Peroxisome proliferator-activated receptor gamma
Name:Peroxisome proliferator-activated receptor gamma
Type:Nuclear Receptor
Mol. Mass.:57613.46
Organism:Homo sapiens (Human)
Description:P37231
Residue:505
BDBM50122340
NameBDBM50122340
Synonyms:(S)-3-[4-(3,3-Diphenyl-allyloxy)-phenyl]-2-ethoxy-propionic acid | CHEMBL314483
TypeSmall organic molecule
Emp. Form.C26H26O4
Mol. Mass.402.4822
SMILES[#6]-[#6]-[#8]-[#6@@H](-[#6]-c1ccc(-[#8]-[#6]\[#6]=[#6](/c2ccccc2)-c2ccccc2)cc1)-[#6](-[#8])=O