Reaction Details
TargetType-1 angiotensin II receptor
LigandBDBM50042235
Substrate/Competitorn/a
Meas. Tech.ChEMBL_321233 (CHEMBL881768)
Ki 0.800000±n/a nM
Citation Morphy, RRankovic, Z Designed multiple ligands. An emerging drug discovery paradigm. J Med Chem48:6523-43 (2005) 
 
Type-1 angiotensin II receptor
Name:Type-1 angiotensin II receptor
Type:Protein
Mol. Mass.:41080.75
Organism:Homo sapiens (Human)
Description:P30556
Residue:359
BDBM50042235
NameBDBM50042235
Synonyms:2-butyl-3-{[2'-(1H-tetrazol-5-yl)[1,1'-biphenyl]-4-yl]methyl}-1,3-diazaspiro[4.4]non-1-en-4-one BMS 186295 IRBESARTAN
TypeSmall organic molecule
Emp. Form.C25H28N6O
Mol. Mass.428.5294
SMILESCCCCC1=NC2(CCCC2)C(=O)N1Cc1ccc(cc1)-c1ccccc1-c1nnn[nH]1