Reaction Details
TargetHistamine H3 receptor
LigandBDBM50128875
Substrate/Competitorn/a
Meas. Tech.ChEMBL_320750 (CHEMBL881223)
Ki 15±n/a nM
Citation Morphy, RRankovic, Z Designed multiple ligands. An emerging drug discovery paradigm. J Med Chem48:6523-43 (2005) 
 
Histamine H3 receptor
Name:Histamine H3 receptor
Type:G Protein-Coupled Receptor (GPCR)
Mol. Mass.:48691.47
Organism:Homo sapiens (Human)
Description:Binding assays were using CHO cells stably expressing hH3R receptors.
Residue:445
BDBM50128875
NameBDBM50128875
Synonyms:CHEMBL292195 | [3-(4-Chloro-phenyl)-3-pyridin-2-yl-propyl]-[4-(1H-imidazol-4-yl)-butyl]-methyl-amine
TypeSmall organic molecule
Emp. Form.C22H27ClN4
Mol. Mass.382.93
SMILESCN(CCCCc1cnc[nH]1)CCC(c1ccc(Cl)cc1)c1ccccn1