Reaction Details
TargetD(2) dopamine receptor
LigandBDBM50092053
Substrate/Competitorn/a
Meas. Tech.ChEMBL_320746 (CHEMBL881219)
IC50 690±n/a nM
Citation Morphy, RRankovic, Z Designed multiple ligands. An emerging drug discovery paradigm. J Med Chem48:6523-43 (2005) 
 
D(2) dopamine receptor
Name:D(2) dopamine receptor
Type:Cell-surface receptors
Mol. Mass.:50647.10
Organism:Homo sapiens (Human)
Description:P14416
Residue:443
BDBM50092053
NameBDBM50092053
Synonyms:2-[4-(4-Chloro-benzyl)-piperazin-1-yl]-1-(2,3-dihydro-indol-1-yl)-ethanone | CHEMBL69584
TypeSmall organic molecule
Emp. Form.C21H24ClN3O
Mol. Mass.369.888
SMILESClc1ccc(CN2CCN(CC(=O)N3CCc4ccccc34)CC2)cc1