Reaction Details
TargetD(4) dopamine receptor
LigandBDBM50092053
Substrate/Competitorn/a
Meas. Tech.ChEMBL_321165 (CHEMBL872218)
IC50 1.6±n/a nM
Citation Morphy, RRankovic, Z Designed multiple ligands. An emerging drug discovery paradigm. J Med Chem48:6523-43 (2005) 
 
D(4) dopamine receptor
Name:D(4) dopamine receptor
Type:Enzyme
Mol. Mass.:48373.19
Organism:Homo sapiens (Human)
Description:P21917
Residue:419
BDBM50092053
NameBDBM50092053
Synonyms:2-[4-(4-Chloro-benzyl)-piperazin-1-yl]-1-(2,3-dihydro-indol-1-yl)-ethanone | CHEMBL69584
TypeSmall organic molecule
Emp. Form.C21H24ClN3O
Mol. Mass.369.888
SMILESClc1ccc(CN2CCN(CC(=O)N3CCc4ccccc34)CC2)cc1