Reaction Details
TargetSodium-dependent serotonin transporter
LigandBDBM50175500
Substrate/Competitorn/a
Meas. Tech.ChEMBL_321179 (CHEMBL882908)
IC50 42±n/a nM
Citation Morphy, RRankovic, Z Designed multiple ligands. An emerging drug discovery paradigm. J Med Chem48:6523-43 (2005) 
 
Sodium-dependent serotonin transporter
Name:Sodium-dependent serotonin transporter
Type:Multi-pass membrane protein
Mol. Mass.:70322.51
Organism:Homo sapiens (Human)
Description:P31645
Residue:630
BDBM50175500
NameBDBM50175500
Synonyms:(S)-4-(1-(methylamino)-3-(4-nitrophenoxy)propyl)phenyl dimethylcarbamate Dimethyl-carbamic acid 4-[(S)-1-methylamino-3-(4-nitro-phenoxy)-propyl]-phenyl ester
TypeSmall organic molecule
Emp. Form.C19H23N3O5
Mol. Mass.373.403
SMILESCN[C@@H](CCOc1ccc(cc1)[N+]([O-])=O)c1ccc(OC(=O)N(C)C)cc1