Reaction Details
Target5-hydroxytryptamine receptor 1A
LigandBDBM50057128
Substrate/Competitorn/a
Meas. Tech.ChEMBL_320761 (CHEMBL884575)
Ki 2±n/a nM
Citation Morphy, RRankovic, Z Designed multiple ligands. An emerging drug discovery paradigm. J Med Chem48:6523-43 (2005) 
 
5-hydroxytryptamine receptor 1A
Name:5-hydroxytryptamine receptor 1A
Type:n/a
Mol. Mass.:46122.49
Organism:Homo sapiens (Human)
Description:n/a
Residue:422
BDBM50057128
NameBDBM50057128
Synonyms:(2-Benzofuran-6-yl-ethyl)-((R)-5-methoxy-1,2,3,4-tetrahydro-naphthalen-1-ylmethyl)-methyl-amine CHEMBL268258
TypeSmall organic molecule
Emp. Form.C23H27NO2
Mol. Mass.349.466
SMILESCOc1cccc2[C@H](CN(C)CCc3ccc4ccoc4c3)CCCc12