Reaction Details
TargetPeroxisome proliferator-activated receptor gamma
LigandBDBM50175504
Substrate/Competitorn/a
Meas. Tech.ChEMBL_320735 (CHEMBL881208)
Kd 9800±n/a nM
Citation Morphy, RRankovic, Z Designed multiple ligands. An emerging drug discovery paradigm. J Med Chem48:6523-43 (2005) 
 
Peroxisome proliferator-activated receptor gamma
Name:Peroxisome proliferator-activated receptor gamma
Type:Nuclear Receptor
Mol. Mass.:57613.46
Organism:Homo sapiens (Human)
Description:P37231
Residue:505
BDBM50175504
NameBDBM50175504
Synonyms:3-{4-[2-(Dibenzo[b,f][1,4]thiazepin-11-yl-methyl-amino)-ethoxy]-phenyl}-2-ethoxy-propionic acid | CHEMBL194411
TypeSmall organic molecule
Emp. Form.C27H28N2O4S
Mol. Mass.476.587
SMILESCCOC(Cc1ccc(OCCN(C)C2=Nc3ccccc3Sc3ccccc23)cc1)C(O)=O