Reaction Details
TargetEquilibrative nucleoside transporter 1
LigandBDBM23617
Substrate/Competitorn/a
Meas. Tech.ChEMBL_321555 (CHEMBL881969)
IC50 0.30±n/a nM
Citation Minetti, PTinti, MOCarminati, PCastorina, MDi Cesare, MADi Serio, SGallo, GGhirardi, OGiorgi, FGiorgi, LPiersanti, GBartoccini, FTarzia, G 2-n-Butyl-9-methyl-8-[1,2,3]triazol-2-yl-9H-purin-6-ylamine and analogues as A2A adenosine receptor antagonists. Design, synthesis, and pharmacological characterization. J Med Chem48:6887-96 (2005) 
 
Equilibrative nucleoside transporter 1
Name:Equilibrative nucleoside transporter 1
Type:PROTEIN
Mol. Mass.:50023.68
Organism:Rattus norvegicus
Description:ChEMBL_181682
Residue:457
BDBM23617
NameBDBM23617
Synonyms:(2R,3S,4R,5R)-2-(hydroxymethyl)-5-(6-{[(4-nitrophenyl)methyl]sulfanyl}-9H-purin-9-yl)oxolane-3,4-diol CHEMBL418509 NBTI | Nitrobenzylthioinosine
TypeSmall organic molecule
Emp. Form.C17H17N5O6S
Mol. Mass.419.412
SMILESOC[C@H]1O[C@H]([C@H](O)[C@@H]1O)n1cnc2c(SCc3ccc(cc3)[N+]([O-])=O)ncnc12