Reaction Details
TargetAdenosine receptor A2a
LigandBDBM50370687
Substrate/Competitorn/a
Meas. Tech.ChEMBL_321018 (CHEMBL883651)
Ki 51±n/a nM
Citation Minetti, PTinti, MOCarminati, PCastorina, MDi Cesare, MADi Serio, SGallo, GGhirardi, OGiorgi, FGiorgi, LPiersanti, GBartoccini, FTarzia, G 2-n-Butyl-9-methyl-8-[1,2,3]triazol-2-yl-9H-purin-6-ylamine and analogues as A2A adenosine receptor antagonists. Design, synthesis, and pharmacological characterization. J Med Chem48:6887-96 (2005) 
 
Adenosine receptor A2a
Name:Adenosine receptor A2a
Type:G Protein-Coupled Receptor (GPCR)
Mol. Mass.:44716.46
Organism:Homo sapiens (Human)
Description:P29274
Residue:412
BDBM50370687
NameBDBM50370687
Synonyms:CHEMBL1204225
TypeSmall organic molecule
Emp. Form.C23H29N7O6
Mol. Mass.499.5197
SMILESCCNC(=O)[C@H]1OC([C@H](O)[C@@H]1O)n1cnc2c(N)nc(NCCc3ccc(CCC(O)=O)cc3)nc12