Reaction Details
TargetAdenosine receptor A2b
LigandBDBM50176059
Substrate/Competitorn/a
Meas. Tech.ChEMBL_321017 (CHEMBL883650)
Ki 2330±n/a nM
Citation Minetti, PTinti, MOCarminati, PCastorina, MDi Cesare, MADi Serio, SGallo, GGhirardi, OGiorgi, FGiorgi, LPiersanti, GBartoccini, FTarzia, G 2-n-Butyl-9-methyl-8-[1,2,3]triazol-2-yl-9H-purin-6-ylamine and analogues as A2A adenosine receptor antagonists. Design, synthesis, and pharmacological characterization. J Med Chem48:6887-96 (2005) 
 
Adenosine receptor A2b
Name:Adenosine receptor A2b
Type:G Protein-Coupled Receptor (GPCR)
Mol. Mass.:36341.22
Organism:Homo sapiens (Human)
Description:n/a
Residue:332
BDBM50176059
NameBDBM50176059
Synonyms:9-Methyl-2-phenethyl-8-[1,2,3]triazol-2-yl-9H-purin-6-ylamine | CHEMBL196259
TypeSmall organic molecule
Emp. Form.C16H16N8
Mol. Mass.320.3518
SMILESCn1c(nc2c(N)nc(CCc3ccccc3)nc12)-n1nccn1