Reaction Details
TargetAdenosine receptor A1
LigandBDBM50176058
Substrate/Competitorn/a
Meas. Tech.ChEMBL_321012 (CHEMBL871844)
Ki 72±n/a nM
Citation Minetti, PTinti, MOCarminati, PCastorina, MDi Cesare, MADi Serio, SGallo, GGhirardi, OGiorgi, FGiorgi, LPiersanti, GBartoccini, FTarzia, G 2-n-Butyl-9-methyl-8-[1,2,3]triazol-2-yl-9H-purin-6-ylamine and analogues as A2A adenosine receptor antagonists. Design, synthesis, and pharmacological characterization. J Med Chem48:6887-96 (2005) 
 
Adenosine receptor A1
Name:Adenosine receptor A1
Type:G Protein-Coupled Receptor (GPCR)
Mol. Mass.:36520.92
Organism:Homo sapiens (Human)
Description:P30542
Residue:326
BDBM50176058
NameBDBM50176058
Synonyms:2-Butyl-9-methyl-8-[1,2,3]triazol-2-yl-9H-purin-6-ylamine CHEMBL197669 | ST-1535
TypeSmall organic molecule
Emp. Form.C12H16N8
Mol. Mass.272.309
SMILESCCCCc1nc(N)c2nc(-n3nccn3)n(C)c2n1