Reaction Details
TargetPlasminogen
LigandBDBM50292273
Substrate/Competitorn/a
Meas. Tech.ChEMBL_321240 (CHEMBL881775)
IC50 13500±n/a nM
Citation Xue, FSeto, CT Selective inhibitors of the serine protease plasmin: probing the S3 and S3' subsites using a combinatorial library. J Med Chem48:6908-17 (2005) 
 
Plasminogen
Name:Plasminogen
Type:Enzyme
Mol. Mass.:90579.18
Organism:Homo sapiens (Human)
Description:n/a
Residue:810
BDBM50292273
NameBDBM50292273
Synonyms:CHEMBL265019 | Cyclohexanone derivative
TypeSmall organic molecule
Emp. Form.C65H76N12O13
Mol. Mass.1233.3715
SMILESCC[C@H](C)[C@H](N)C(=O)[C@H](NC(=O)[C@@H](NC(=O)CC[C@H]1CCC[C@@H](NC(=O)[C@@H](NC(=O)[C@@H](NC(=O)OCc2ccccc2)C(=O)[C@@H](N)Cc2c[nH]c3ccccc23)C(=O)[C@@H](N)Cc2c[nH]c3ccccc23)C1=O)C(=O)[C@@H](N)Cc1c[nH]c2ccccc12)C(=O)OC