Reaction Details
TargetNuclear receptor subfamily 1 group I member 2
LigandBDBM21725
Substrate/Competitorn/a
Meas. Tech.ChEMBL_321252 (CHEMBL880930)
IC50 2.4±n/a nM
Citation Meyer, UCostantino, GMacchiarulo, APellicciari, R Is antagonism of E/Z-guggulsterone at the farnesoid X receptor mediated by a noncanonical binding site? A molecular modeling study. J Med Chem48:6948-55 (2005) 
 
Nuclear receptor subfamily 1 group I member 2
Name:Nuclear receptor subfamily 1 group I member 2
Type:Nuclear receptor
Mol. Mass.:49774.77
Organism:Homo sapiens (Human)
Description:O75469
Residue:434
BDBM21725
NameBDBM21725
Synonyms:(1S,2R,10R,11S,14Z,15S)-14-ethylidene-2,15-dimethyltetracyclo[8.7.0.0^{2,7}.0^{11,15}]heptadec-6-ene-5,13-dione | Guggulsterone
TypeSteroid
Emp. Form.C21H28O2
Mol. Mass.312.4458
SMILES[H][C@@]12CC(=O)C(=CC)[C@@]1(C)CC[C@@]1([H])[C@@]2([H])CCC2=CC(=O)CC[C@]12C