Reaction Details
TargetMineralocorticoid receptor
LigandBDBM50226465
Substrate/Competitorn/a
Meas. Tech.ChEMBL_320811 (CHEMBL872346)
Ki 39±n/a nM
Citation Meyer, UCostantino, GMacchiarulo, APellicciari, R Is antagonism of E/Z-guggulsterone at the farnesoid X receptor mediated by a noncanonical binding site? A molecular modeling study. J Med Chem48:6948-55 (2005) 
 
Mineralocorticoid receptor
Name:Mineralocorticoid receptor
Type:Enzyme
Mol. Mass.:107076.42
Organism:Homo sapiens (Human)
Description:P08235
Residue:984
BDBM50226465
NameBDBM50226465
Synonyms:CHEMBL402063 pregna-4,17(20)-cis-diene-3,16-dione
TypeSmall organic molecule
Emp. Form.C21H28O2
Mol. Mass.312.4458
SMILESCC=C1C(=O)C[C@H]2[C@@H]3CCC4=CC(=O)CC[C@]4(C)[C@H]3CC[C@]12C