Reaction Details
TargetAdenosine receptor A3
LigandBDBM21216
Substrate/Competitorn/a
Meas. Tech.ChEMBL_325562 (CHEMBL860281)
Ki 955±n/a nM
Citation Novellino, ECosimelli, BEhlardo, MGreco, GIadanza, MLavecchia, ARimoli, MGSala, ADa Settimo, APrimofiore, GDa Settimo, FTaliani, SLa Motta, CKlotz, KNTuscano, DTrincavelli, MLMartini, C 2-(Benzimidazol-2-yl)quinoxalines: a novel class of selective antagonists at human A(1) and A(3) adenosine receptors designed by 3D database searching. J Med Chem48:8253-60 (2005) 
 
Adenosine receptor A3
Name:Adenosine receptor A3
Type:G Protein-Coupled Receptor (GPCR)
Mol. Mass.:36197.32
Organism:Homo sapiens (Human)
Description:P0DMS8
Residue:318
BDBM21216
NameBDBM21216
Synonyms:2-[4-(ethylsulfanyl)-1H-1,3-benzodiazol-2-yl]quinoxaline CHEMBL198008 | benzimidazole-quinoxaline, C2
TypeSmall organic molecule
Emp. Form.C17H14N4S
Mol. Mass.306.385
SMILESCCSc1cccc2nc([nH]c12)-c1cnc2ccccc2n1