Reaction Details
TargetSigma non-opioid intracellular receptor 1
LigandBDBM50179260
Substrate/Competitorn/a
Meas. Tech.ChEMBL_325587 (CHEMBL860170)
Ki 0.35±n/a nM
Citation Berardi, FFerorelli, SAbate, CPedone, MPColabufo, NAContino, MPerrone, R Methyl substitution on the piperidine ring of N-[omega-(6-methoxynaphthalen-1-yl)alkyl] derivatives as a probe for selective binding and activity at the sigma(1) receptor. J Med Chem48:8237-44 (2005) 
 
Sigma non-opioid intracellular receptor 1
Name:Sigma non-opioid intracellular receptor 1
Type:Protein
Mol. Mass.:25307.17
Organism:Cavia porcellus (Guinea pig)
Description:Q60492
Residue:223
BDBM50179260
NameBDBM50179260
Synonyms:1-(3-(6-methoxynaphthalen-1-yl)propyl)-3,3-dimethylpiperidine hydrochloride CHEMBL178326 | CHEMBL537177
TypeSmall organic molecule
Emp. Form.C21H29NO
Mol. Mass.311.4611
SMILESCOc1ccc2c(CCCN3CCCC(C)(C)C3)cccc2c1