Reaction Details
Target3-beta-hydroxysteroid-Delta(8),Delta(7)-isomerase
LigandBDBM50179275
Substrate/Competitorn/a
Meas. Tech.ChEMBL_325589 (CHEMBL860172)
Ki 6.44±n/a nM
Citation Berardi, FFerorelli, SAbate, CPedone, MPColabufo, NAContino, MPerrone, R Methyl substitution on the piperidine ring of N-[omega-(6-methoxynaphthalen-1-yl)alkyl] derivatives as a probe for selective binding and activity at the sigma(1) receptor. J Med Chem48:8237-44 (2005) 
 
3-beta-hydroxysteroid-Delta(8),Delta(7)-isomerase
Name:3-beta-hydroxysteroid-Delta(8),Delta(7)-isomerase
Type:PROTEIN
Mol. Mass.:26684.52
Organism:Cavia porcellus
Description:ChEMBL_203193
Residue:229
BDBM50179275
NameBDBM50179275
Synonyms:(-)-(R)-1-(4-(6-methoxynaphthalen-1-yl)butyl)-2-methylpiperidine hydrochloride | CHEMBL535363
TypeSmall organic molecule
Emp. Form.C21H29NO
Mol. Mass.311.4611
SMILESCOc1ccc2c(CCCCN3CCCC[C@H]3C)cccc2c1