Reaction Details
TargetSigma non-opioid intracellular receptor 1
LigandBDBM50179269
Substrate/Competitorn/a
Meas. Tech.ChEMBL_325587 (CHEMBL860170)
Ki 0.42±n/a nM
Citation Berardi, FFerorelli, SAbate, CPedone, MPColabufo, NAContino, MPerrone, R Methyl substitution on the piperidine ring of N-[omega-(6-methoxynaphthalen-1-yl)alkyl] derivatives as a probe for selective binding and activity at the sigma(1) receptor. J Med Chem48:8237-44 (2005) 
 
Sigma non-opioid intracellular receptor 1
Name:Sigma non-opioid intracellular receptor 1
Type:Protein
Mol. Mass.:25307.17
Organism:Cavia porcellus (Guinea pig)
Description:Q60492
Residue:223
BDBM50179269
NameBDBM50179269
Synonyms:1-(4-(6-methoxy-1,2,3,4-tetrahydronaphthalen-1-yl)butyl)-4-methylpiperidine hydrochloride | CHEMBL540573
TypeSmall organic molecule
Emp. Form.C21H33NO
Mol. Mass.315.4928
SMILESCOc1ccc2C(CCCCN3CCC(C)CC3)CCCc2c1