Reaction Details
Target3-beta-hydroxysteroid-Delta(8),Delta(7)-isomerase
LigandBDBM50007674
Substrate/Competitorn/a
Meas. Tech.ChEMBL_325589 (CHEMBL860172)
Ki 4.7±n/a nM
Citation Berardi, FFerorelli, SAbate, CPedone, MPColabufo, NAContino, MPerrone, R Methyl substitution on the piperidine ring of N-[omega-(6-methoxynaphthalen-1-yl)alkyl] derivatives as a probe for selective binding and activity at the sigma(1) receptor. J Med Chem48:8237-44 (2005) 
 
3-beta-hydroxysteroid-Delta(8),Delta(7)-isomerase
Name:3-beta-hydroxysteroid-Delta(8),Delta(7)-isomerase
Type:PROTEIN
Mol. Mass.:26684.52
Organism:Cavia porcellus
Description:ChEMBL_203193
Residue:229
BDBM50007674
NameBDBM50007674
Synonyms:(+)-erythro 4-[2-(4-Benzyl-piperidin-1-yl)-1-hydroxy-propyl]-phenol 4-[(1R,2S)-2-(4-Benzyl-piperidin-1-yl)-1-hydroxy-propyl]-phenol 4-[2-(4-Benzyl-piperidin-1-yl)-1-hydroxy-propyl]-phenol Ifenprodil | Ifenprodil,(+/-)
TypeSmall organic molecule
Emp. Form.C21H27NO2
Mol. Mass.325.4446
SMILESC[C@@H]([C@H](O)c1ccc(O)cc1)N1CCC(Cc2ccccc2)CC1