Reaction Details
TargetIntegrin alpha-V/beta-5
LigandBDBM50177878
Substrate/Competitorn/a
Meas. Tech.ChEMBL_325768 (CHEMBL863348)
IC50 4.56±n/a nM
Citation Casiraghi, GRassu, GAuzzas, LBurreddu, PGaetani, EBattistini, LZanardi, FCurti, CNicastro, GBelvisi, LMotto, ICastorina, MGiannini, GPisano, C Grafting aminocyclopentane carboxylic acids onto the RGD tripeptide sequence generates low nanomolar alphaVbeta3/alphaVbeta5 integrin dual binders. J Med Chem48:7675-87 (2005) 
 
Integrin alpha-V/beta-5
Name:Integrin alpha-V/beta-5
Type:Enzyme
Mol. Mass.:n/a
Description:n/a
Components:This complex has 2 components.
Component 1
Name:Integrin alpha-V
Synonyms:ITAV_HUMAN Integrin alpha-V/alpha-5 VNRA Vitronectin receptor | Vitronectin receptor subunit alpha
Type:PROTEIN
Mol. Mass.:116024.92
Organism:Homo sapiens (Human)
Description:ChEMBL_582336
Residue:1048
Component 2
Name:Integrin beta-5
Synonyms:ITB5_HUMAN | ITGB5
Type:PROTEIN
Mol. Mass.:88047.37
Organism:Homo sapiens (Human)
Description:EBI_10915
Residue:799
BDBM50177878
NameBDBM50177878
Synonyms:CHEMBL557157 | c[-Arg-Gly-Asp-Acpca36-]
TypeSmall organic molecule
Emp. Form.C18H29N7O7
Mol. Mass.455.4656
SMILES[#7]\[#6](-[#7])=[#7]\[#6]-[#6]-[#6]-[#6@@H]-1-[#7]-[#6](=O)-[#6@H]-2-[#6]-[#6@H](-[#8])-[#6@H](-[#6]-2)-[#7]-[#6](=O)-[#6@H](-[#6]-[#6](-[#8])=O)-[#7]-[#6](=O)-[#6]-[#7]-[#6]-1=O