Reaction Details
TargetIntegrin alpha-V/beta-3
LigandBDBM50177883
Substrate/Competitorn/a
Meas. Tech.ChEMBL_325767 (CHEMBL863347)
IC50 7.2±n/a nM
Citation Casiraghi, GRassu, GAuzzas, LBurreddu, PGaetani, EBattistini, LZanardi, FCurti, CNicastro, GBelvisi, LMotto, ICastorina, MGiannini, GPisano, C Grafting aminocyclopentane carboxylic acids onto the RGD tripeptide sequence generates low nanomolar alphaVbeta3/alphaVbeta5 integrin dual binders. J Med Chem48:7675-87 (2005) 
 
Integrin alpha-V/beta-3
Name:Integrin alpha-V/beta-3
Type:Enzyme
Mol. Mass.:n/a
Description:n/a
Components:This complex has 2 components.
Component 1
Name:Integrin alpha-V
Synonyms:ITAV_HUMAN Integrin alpha-V/alpha-5 VNRA Vitronectin receptor | Vitronectin receptor subunit alpha
Type:PROTEIN
Mol. Mass.:116024.92
Organism:Homo sapiens (Human)
Description:ChEMBL_582336
Residue:1048
Component 2
Name:Integrin beta-3
Synonyms:CD_antigen=CD61 GPIIIa ITGB3 Platelet membrane glycoprotein IIIa
Type:Protein
Mol. Mass.:87038.91
Organism:Homo sapiens (Human)
Description:P05106
Residue:788
BDBM50177883
NameBDBM50177883
Synonyms:CHEMBL534713 | c[-Arg-Gly-Asp-Acpca35-]
TypeSmall organic molecule
Emp. Form.C18H29N7O7
Mol. Mass.455.4656
SMILES[#7]\[#6](-[#7])=[#7]\[#6]-[#6]-[#6]-[#6@@H]-1-[#7]-[#6](=O)-[#6@@H]-2-[#6]-[#6@@H](-[#8])-[#6@@H](-[#6]-2)-[#7]-[#6](=O)-[#6@H](-[#6]-[#6](-[#8])=O)-[#7]-[#6](=O)-[#6]-[#7]-[#6]-1=O