Reaction Details
TargetC-C chemokine receptor type 1
LigandBDBM50174714
Substrate/Competitorn/a
Meas. Tech.ChEMBL_325888 (CHEMBL863245)
IC50 20±n/a nM
Citation Revesz, LBollbuck, BBuhl, TEder, JEsser, RFeifel, RHeng, RHiestand, PJachez-Demange, BLoetscher, PSparrer, HSchlapbach, AWaelchli, R Novel CCR1 antagonists with oral activity in the mouse collagen induced arthritis. Bioorg Med Chem Lett15:5160-4 (2005) 
 
C-C chemokine receptor type 1
Name:C-C chemokine receptor type 1
Type:Enzyme
Mol. Mass.:41180.69
Organism:Homo sapiens (Human)
Description:P32246
Residue:355
BDBM50174714
NameBDBM50174714
Synonyms:(R)-N-(2-(3-(4-(4-fluorobenzyl)-2-methylpiperazin-1-yl)-3-oxoprop-1-enyl)-5-chloro-4-methoxyphenyl)acetamide | CHEMBL200629
TypeSmall organic molecule
Emp. Form.C24H27ClFN3O3
Mol. Mass.459.941
SMILESCOc1cc(\C=C\C(=O)N2CCN(Cc3ccc(F)cc3)C[C@H]2C)c(NC(C)=O)cc1Cl