Reaction Details
TargetC-C chemokine receptor type 1
LigandBDBM50174717
Substrate/Competitorn/a
Meas. Tech.ChEMBL_325888 (CHEMBL863245)
IC50 1000±n/a nM
Citation Revesz, LBollbuck, BBuhl, TEder, JEsser, RFeifel, RHeng, RHiestand, PJachez-Demange, BLoetscher, PSparrer, HSchlapbach, AWaelchli, R Novel CCR1 antagonists with oral activity in the mouse collagen induced arthritis. Bioorg Med Chem Lett15:5160-4 (2005) 
 
C-C chemokine receptor type 1
Name:C-C chemokine receptor type 1
Type:Enzyme
Mol. Mass.:41180.69
Organism:Homo sapiens (Human)
Description:P32246
Residue:355
BDBM50174717
NameBDBM50174717
Synonyms:(R)-N-(2-(1-(4-fluorobenzyl)-3-methylpiperazine-4-carbonyl)-5-chlorobenzofuran-7-yl)acetamide | CHEMBL198966
TypeSmall organic molecule
Emp. Form.C23H23ClFN3O3
Mol. Mass.443.898
SMILESC[C@@H]1CN(Cc2ccc(F)cc2)CCN1C(=O)c1cc2cc(Cl)cc(NC(C)=O)c2o1