Reaction Details
TargetC-C chemokine receptor type 1
LigandBDBM50174711
Substrate/Competitorn/a
Meas. Tech.ChEMBL_325890 (CHEMBL863247)
IC50 1±n/a nM
Citation Revesz, LBollbuck, BBuhl, TEder, JEsser, RFeifel, RHeng, RHiestand, PJachez-Demange, BLoetscher, PSparrer, HSchlapbach, AWaelchli, R Novel CCR1 antagonists with oral activity in the mouse collagen induced arthritis. Bioorg Med Chem Lett15:5160-4 (2005) 
 
C-C chemokine receptor type 1
Name:C-C chemokine receptor type 1
Type:Enzyme
Mol. Mass.:41180.69
Organism:Homo sapiens (Human)
Description:P32246
Residue:355
BDBM50174711
NameBDBM50174711
Synonyms:CHEMBL197345 | N-(2-(3-((2S,5R)-4-(4-fluorobenzyl)-2,5-dimethylpiperazin-1-yl)-3-oxoprop-1-enyl)-5-chlorophenyl)acetamide
TypeSmall organic molecule
Emp. Form.C24H27ClFN3O2
Mol. Mass.443.941
SMILESC[C@@H]1CN([C@@H](C)CN1Cc1ccc(F)cc1)C(=O)\C=C\c1ccc(Cl)cc1NC(C)=O