Reaction Details
TargetC-C chemokine receptor type 1
LigandBDBM50174704
Substrate/Competitorn/a
Meas. Tech.ChEMBL_325887 (CHEMBL863244)
IC50 560±n/a nM
Citation Revesz, LBollbuck, BBuhl, TEder, JEsser, RFeifel, RHeng, RHiestand, PJachez-Demange, BLoetscher, PSparrer, HSchlapbach, AWaelchli, R Novel CCR1 antagonists with oral activity in the mouse collagen induced arthritis. Bioorg Med Chem Lett15:5160-4 (2005) 
 
C-C chemokine receptor type 1
Name:C-C chemokine receptor type 1
Type:Enzyme
Mol. Mass.:41180.69
Organism:Homo sapiens (Human)
Description:P32246
Residue:355
BDBM50174704
NameBDBM50174704
Synonyms:(R)-N-(2-(1-(4-fluorobenzyl)-3-methylpiperazine-4-carbonyl)-5-chloro-1H-indol-7-yl)acetamide | CHEMBL200794
TypeSmall organic molecule
Emp. Form.C23H24ClFN4O2
Mol. Mass.442.914
SMILESC[C@@H]1CN(Cc2ccc(F)cc2)CCN1C(=O)c1cc2cc(Cl)cc(NC(C)=O)c2[nH]1