Reaction Details
TargetC-C chemokine receptor type 1
LigandBDBM50174708
Substrate/Competitorn/a
Meas. Tech.ChEMBL_325889 (CHEMBL863246)
IC50 600±n/a nM
Citation Revesz, LBollbuck, BBuhl, TEder, JEsser, RFeifel, RHeng, RHiestand, PJachez-Demange, BLoetscher, PSparrer, HSchlapbach, AWaelchli, R Novel CCR1 antagonists with oral activity in the mouse collagen induced arthritis. Bioorg Med Chem Lett15:5160-4 (2005) 
 
C-C chemokine receptor type 1
Name:C-C chemokine receptor type 1
Type:PROTEIN
Mol. Mass.:40904.59
Organism:Mus musculus
Description:ChEMBL_1452291
Residue:355
BDBM50174708
NameBDBM50174708
Synonyms:CHEMBL197375 | N-(2-(3-((2R,5S)-4-(4-fluorobenzyl)-2,5-dimethylpiperazin-1-yl)-3-oxoprop-1-enyl)-5-chlorophenyl)acetamide
TypeSmall organic molecule
Emp. Form.C24H27ClFN3O2
Mol. Mass.443.941
SMILESC[C@H]1CN([C@H](C)CN1Cc1ccc(F)cc1)C(=O)\C=C\c1ccc(Cl)cc1NC(C)=O