Reaction Details
TargetC-C chemokine receptor type 1
LigandBDBM50174713
Substrate/Competitorn/a
Meas. Tech.ChEMBL_325889 (CHEMBL863246)
IC50 448±n/a nM
Citation Revesz, LBollbuck, BBuhl, TEder, JEsser, RFeifel, RHeng, RHiestand, PJachez-Demange, BLoetscher, PSparrer, HSchlapbach, AWaelchli, R Novel CCR1 antagonists with oral activity in the mouse collagen induced arthritis. Bioorg Med Chem Lett15:5160-4 (2005) 
 
C-C chemokine receptor type 1
Name:C-C chemokine receptor type 1
Type:PROTEIN
Mol. Mass.:40904.59
Organism:Mus musculus
Description:ChEMBL_1452291
Residue:355
BDBM50174713
NameBDBM50174713
Synonyms:CHEMBL198852 | N-(2-(3-(4-(4-fluorobenzyl)piperazin-1-yl)-3-oxoprop-1-enyl)-5-chlorophenyl)acetamide
TypeSmall organic molecule
Emp. Form.C22H23ClFN3O2
Mol. Mass.415.888
SMILESCC(=O)Nc1cc(Cl)ccc1\C=C\C(=O)N1CCN(Cc2ccc(F)cc2)CC1