Reaction Details
TargetAldo-keto reductase family 1 member C3
LigandBDBM50174201
Substrate/Competitorn/a
Meas. Tech.ChEMBL_326008 (CHEMBL869399)
IC50 2600±n/a nM
Citation Gobec, SBrozic, PRizner, TL Nonsteroidal anti-inflammatory drugs and their analogues as inhibitors of aldo-keto reductase AKR1C3: new lead compounds for the development of anticancer agents. Bioorg Med Chem Lett15:5170-5 (2005) 
 
Aldo-keto reductase family 1 member C3
Name:Aldo-keto reductase family 1 member C3
Type:Enzyme
Mol. Mass.:36859.86
Organism:Homo sapiens (Human)
Description:P42330
Residue:323
BDBM50174201
NameBDBM50174201
Synonyms:ARTHROTEC SOLARAZE US11173137, Compound Diclofenac VOLTAREN-XR sodium 2-(2-(2,6-dichlorophenylamino)phenyl)acetate
TypeSmall organic molecule
Emp. Form.C14H10Cl2NO2
Mol. Mass.295.141
SMILES[O-]C(=O)Cc1ccccc1Nc1c(Cl)cccc1Cl