Reaction Details
TargetCarbonic anhydrase 2
LigandBDBM50175001
Substrate/Competitorn/a
Meas. Tech.ChEMBL_326095 (CHEMBL869402)
Ki 113±n/a nM
Citation Cecchi, ATaylor, SDLiu, YHill, BVullo, DScozzafava, ASupuran, CT Carbonic anhydrase inhibitors: inhibition of the human isozymes I, II, VA, and IX with a library of substituted difluoromethanesulfonamides. Bioorg Med Chem Lett15:5192-6 (2005) 
 
Carbonic anhydrase 2
Name:Carbonic anhydrase 2
Type:Enzyme
Mol. Mass.:29250.71
Organism:Homo sapiens (Human)
Description:P00918
Residue:260
BDBM50175001
NameBDBM50175001
Synonyms:4-nitrophenyl-difluoromethanesulfonamide | CHEMBL370159
TypeSmall organic molecule
Emp. Form.C7H6F2N2O4S
Mol. Mass.252.195
SMILESNS(=O)(=O)C(F)(F)c1ccc(cc1)[N+]([O-])=O