Reaction Details
TargetCarbonic anhydrase 5A, mitochondrial
LigandBDBM50370691
Substrate/Competitorn/a
Meas. Tech.ChEMBL_326096 (CHEMBL869403)
Ki 129±n/a nM
Citation Cecchi, ATaylor, SDLiu, YHill, BVullo, DScozzafava, ASupuran, CT Carbonic anhydrase inhibitors: inhibition of the human isozymes I, II, VA, and IX with a library of substituted difluoromethanesulfonamides. Bioorg Med Chem Lett15:5192-6 (2005) 
 
Carbonic anhydrase 5A, mitochondrial
Name:Carbonic anhydrase 5A, mitochondrial
Type:Enzyme
Mol. Mass.:34755.54
Organism:Homo sapiens (Human)
Description:Human (cloned) isozyme
Residue:305
BDBM50370691
NameBDBM50370691
Synonyms:CHEMBL1628004
TypeSmall organic molecule
Emp. Form.C19H23F2NO3S
Mol. Mass.383.453
SMILESC[C@]12CC[C@H]3[C@@H](CCc4cc(ccc34)C(F)(F)S(N)(=O)=O)[C@@H]1CCC2=O