Reaction Details
TargetCarbonic anhydrase 1
LigandBDBM50175010
Substrate/Competitorn/a
Meas. Tech.ChEMBL_326094 (CHEMBL869401)
Ki 98±n/a nM
Citation Cecchi, ATaylor, SDLiu, YHill, BVullo, DScozzafava, ASupuran, CT Carbonic anhydrase inhibitors: inhibition of the human isozymes I, II, VA, and IX with a library of substituted difluoromethanesulfonamides. Bioorg Med Chem Lett15:5192-6 (2005) 
 
Carbonic anhydrase 1
Name:Carbonic anhydrase 1
Type:Enzyme
Mol. Mass.:28873.37
Organism:Homo sapiens (Human)
Description:P00915
Residue:261
BDBM50175010
NameBDBM50175010
Synonyms:(4-methyl-2-oxo-2H-chromen-7-yl)methanesulfonamide | CHEMBL198913
TypeSmall organic molecule
Emp. Form.C11H11NO4S
Mol. Mass.253.274
SMILESCc1cc(=O)oc2cc(CS(N)(=O)=O)ccc12