Reaction Details
TargetCarbonic anhydrase 1
LigandBDBM50175008
Substrate/Competitorn/a
Meas. Tech.ChEMBL_326094 (CHEMBL869401)
Ki 5200±n/a nM
Citation Cecchi, ATaylor, SDLiu, YHill, BVullo, DScozzafava, ASupuran, CT Carbonic anhydrase inhibitors: inhibition of the human isozymes I, II, VA, and IX with a library of substituted difluoromethanesulfonamides. Bioorg Med Chem Lett15:5192-6 (2005) 
 
Carbonic anhydrase 1
Name:Carbonic anhydrase 1
Type:Enzyme
Mol. Mass.:28873.37
Organism:Homo sapiens (Human)
Description:P00915
Residue:261
BDBM50175008
NameBDBM50175008
Synonyms:(2-bromophenyl)difluoromethanesulfonamide | CHEMBL199493
TypeSmall organic molecule
Emp. Form.C7H6BrF2NO2S
Mol. Mass.286.094
SMILESNS(=O)(=O)C(F)(F)c1ccccc1Br