Reaction Details
TargetCarbonic anhydrase 9
LigandBDBM50098106
Substrate/Competitorn/a
Meas. Tech.ChEMBL_326097 (CHEMBL869404)
Ki 63±n/a nM
Citation Cecchi, ATaylor, SDLiu, YHill, BVullo, DScozzafava, ASupuran, CT Carbonic anhydrase inhibitors: inhibition of the human isozymes I, II, VA, and IX with a library of substituted difluoromethanesulfonamides. Bioorg Med Chem Lett15:5192-6 (2005) 
 
Carbonic anhydrase 9
Name:Carbonic anhydrase 9
Type:Enzyme
Mol. Mass.:49669.03
Organism:Homo sapiens (Human)
Description:Catalytic domain of human cloned isozyme was used in the assay
Residue:459
BDBM50098106
NameBDBM50098106
Synonyms:CHEMBL24259 Sulfamic acid phenyl ester | phenyl sulfamate
TypeSmall organic molecule
Emp. Form.C6H7NO3S
Mol. Mass.173.19
SMILESNS(=O)(=O)Oc1ccccc1