Reaction Details
TargetCarbonic anhydrase 2
LigandBDBM50175010
Substrate/Competitorn/a
Meas. Tech.ChEMBL_326095 (CHEMBL869402)
Ki 32±n/a nM
Citation Cecchi, ATaylor, SDLiu, YHill, BVullo, DScozzafava, ASupuran, CT Carbonic anhydrase inhibitors: inhibition of the human isozymes I, II, VA, and IX with a library of substituted difluoromethanesulfonamides. Bioorg Med Chem Lett15:5192-6 (2005) 
 
Carbonic anhydrase 2
Name:Carbonic anhydrase 2
Type:Enzyme
Mol. Mass.:29250.71
Organism:Homo sapiens (Human)
Description:P00918
Residue:260
BDBM50175010
NameBDBM50175010
Synonyms:(4-methyl-2-oxo-2H-chromen-7-yl)methanesulfonamide | CHEMBL198913
TypeSmall organic molecule
Emp. Form.C11H11NO4S
Mol. Mass.253.274
SMILESCc1cc(=O)oc2cc(CS(N)(=O)=O)ccc12