Reaction Details
TargetCarbonic anhydrase 5A, mitochondrial
LigandBDBM50175001
Substrate/Competitorn/a
Meas. Tech.ChEMBL_326096 (CHEMBL869403)
Ki 153±n/a nM
Citation Cecchi, ATaylor, SDLiu, YHill, BVullo, DScozzafava, ASupuran, CT Carbonic anhydrase inhibitors: inhibition of the human isozymes I, II, VA, and IX with a library of substituted difluoromethanesulfonamides. Bioorg Med Chem Lett15:5192-6 (2005) 
 
Carbonic anhydrase 5A, mitochondrial
Name:Carbonic anhydrase 5A, mitochondrial
Type:Enzyme
Mol. Mass.:34755.54
Organism:Homo sapiens (Human)
Description:Human (cloned) isozyme
Residue:305
BDBM50175001
NameBDBM50175001
Synonyms:4-nitrophenyl-difluoromethanesulfonamide | CHEMBL370159
TypeSmall organic molecule
Emp. Form.C7H6F2N2O4S
Mol. Mass.252.195
SMILESNS(=O)(=O)C(F)(F)c1ccc(cc1)[N+]([O-])=O