Reaction Details
TargetCarbonic anhydrase 9
LigandBDBM50175007
Substrate/Competitorn/a
Meas. Tech.ChEMBL_326097 (CHEMBL869404)
Ki 8500±n/a nM
Citation Cecchi, ATaylor, SDLiu, YHill, BVullo, DScozzafava, ASupuran, CT Carbonic anhydrase inhibitors: inhibition of the human isozymes I, II, VA, and IX with a library of substituted difluoromethanesulfonamides. Bioorg Med Chem Lett15:5192-6 (2005) 
 
Carbonic anhydrase 9
Name:Carbonic anhydrase 9
Type:Enzyme
Mol. Mass.:49669.03
Organism:Homo sapiens (Human)
Description:Catalytic domain of human cloned isozyme was used in the assay
Residue:459
BDBM50175007
NameBDBM50175007
Synonyms:CHEMBL371870 | phenyldifluoromethanesulfonamide
TypeSmall organic molecule
Emp. Form.C7H7F2NO2S
Mol. Mass.207.198
SMILESNS(=O)(=O)C(F)(F)c1ccccc1