Reaction Details
TargetCarbonic anhydrase 1
LigandBDBM50175002
Substrate/Competitorn/a
Meas. Tech.ChEMBL_326094 (CHEMBL869401)
Ki 415±n/a nM
Citation Cecchi, ATaylor, SDLiu, YHill, BVullo, DScozzafava, ASupuran, CT Carbonic anhydrase inhibitors: inhibition of the human isozymes I, II, VA, and IX with a library of substituted difluoromethanesulfonamides. Bioorg Med Chem Lett15:5192-6 (2005) 
 
Carbonic anhydrase 1
Name:Carbonic anhydrase 1
Type:Enzyme
Mol. Mass.:28873.37
Organism:Homo sapiens (Human)
Description:P00915
Residue:261
BDBM50175002
NameBDBM50175002
Synonyms:CHEMBL198891 | difluoro(4-methyl-2-oxo-2H-chromen-7-yl)methanesulfonamide
TypeSmall organic molecule
Emp. Form.C11H9F2NO4S
Mol. Mass.289.255
SMILESCc1cc(=O)oc2cc(ccc12)C(F)(F)S(N)(=O)=O