Reaction Details
TargetCarbonic anhydrase 5A, mitochondrial
LigandBDBM50175005
Substrate/Competitorn/a
Meas. Tech.ChEMBL_326096 (CHEMBL869403)
Ki 1580±n/a nM
Citation Cecchi, ATaylor, SDLiu, YHill, BVullo, DScozzafava, ASupuran, CT Carbonic anhydrase inhibitors: inhibition of the human isozymes I, II, VA, and IX with a library of substituted difluoromethanesulfonamides. Bioorg Med Chem Lett15:5192-6 (2005) 
 
Carbonic anhydrase 5A, mitochondrial
Name:Carbonic anhydrase 5A, mitochondrial
Type:Enzyme
Mol. Mass.:34755.54
Organism:Homo sapiens (Human)
Description:Human (cloned) isozyme
Residue:305
BDBM50175005
NameBDBM50175005
Synonyms:CHEMBL369953 | phenylmethanesulfonamide
TypeSmall organic molecule
Emp. Form.C7H9NO2S
Mol. Mass.171.217
SMILESNS(=O)(=O)Cc1ccccc1