Reaction Details
TargetOxytocin receptor
LigandBDBM50178153
Substrate/Competitorn/a
Meas. Tech.ChEMBL_326541 (CHEMBL863361)
Ki 25±n/a nM
Citation Quattropani, ADorbais, JCovini, DPittet, PAColovray, VThomas, RJCoxhead, RHalazy, SScheer, AMissotten, MAyala, GBradshaw, CDe Raemy-Schenk, AMNichols, ACirillo, RTos, EGGiachetti, CGolzio, LMarinelli, PChurch, DJBarberis, CChollet, ASchwarz, MK Discovery and development of a new class of potent, selective, orally active oxytocin receptor antagonists. J Med Chem48:7882-905 (2005) 
 
Oxytocin receptor
Name:Oxytocin receptor
Type:Enzyme Catalytic Domain
Mol. Mass.:42889.28
Organism:RAT
Description:Oxytocin OXTR RAT::P70536
Residue:388
BDBM50178153
NameBDBM50178153
Synonyms:4-ethoxy-N-(4-methylphenyl)-N-{2-oxo-2-[2-(2-oxo-1,2-dihydro-3H-indol-3-ylidene)hydrazino]ethyl}benzenesulfonamide | CHEMBL199623
TypeSmall organic molecule
Emp. Form.C25H26N4O5S
Mol. Mass.494.563
SMILESCCOc1ccc(cc1)S(=O)(=O)N(CC(=O)NN=C1C(=O)NC2C=CCC=C12)c1ccc(C)cc1