Reaction Details
TargetOxytocin receptor
LigandBDBM50178213
Substrate/Competitorn/a
Meas. Tech.ChEMBL_326537 (CHEMBL863355)
Ki 60±n/a nM
Citation Quattropani, ADorbais, JCovini, DPittet, PAColovray, VThomas, RJCoxhead, RHalazy, SScheer, AMissotten, MAyala, GBradshaw, CDe Raemy-Schenk, AMNichols, ACirillo, RTos, EGGiachetti, CGolzio, LMarinelli, PChurch, DJBarberis, CChollet, ASchwarz, MK Discovery and development of a new class of potent, selective, orally active oxytocin receptor antagonists. J Med Chem48:7882-905 (2005) 
 
Oxytocin receptor
Name:Oxytocin receptor
Type:Enzyme Catalytic Domain
Mol. Mass.:42793.26
Organism:Homo sapiens (Human)
Description:Oxytocin OXTR HEK293::B2R9L7
Residue:389
BDBM50178213
NameBDBM50178213
Synonyms:4-ethoxy-N-{2-[2-(2-hydroxybenzylidene)hydrazino]-2-oxoethyl}-N-(4-methylphenyl)benzenesulfonamide | CHEMBL200329
TypeSmall organic molecule
Emp. Form.C24H25N3O5S
Mol. Mass.467.537
SMILESCCOc1ccc(cc1)S(=O)(=O)N(CC(=O)NN=Cc1ccccc1O)c1ccc(C)cc1