Reaction Details
TargetOxytocin receptor
LigandBDBM50178200
Substrate/Competitorn/a
Meas. Tech.ChEMBL_326537 (CHEMBL863355)
Ki 93±n/a nM
Citation Quattropani, ADorbais, JCovini, DPittet, PAColovray, VThomas, RJCoxhead, RHalazy, SScheer, AMissotten, MAyala, GBradshaw, CDe Raemy-Schenk, AMNichols, ACirillo, RTos, EGGiachetti, CGolzio, LMarinelli, PChurch, DJBarberis, CChollet, ASchwarz, MK Discovery and development of a new class of potent, selective, orally active oxytocin receptor antagonists. J Med Chem48:7882-905 (2005) 
 
Oxytocin receptor
Name:Oxytocin receptor
Type:Enzyme Catalytic Domain
Mol. Mass.:42793.26
Organism:Homo sapiens (Human)
Description:Oxytocin OXTR HEK293::B2R9L7
Residue:389
BDBM50178200
NameBDBM50178200
Synonyms:CHEMBL200415 | N-(3-chloro-2-methylphenyl)-2-(N-p-tolylphenylsulfonamido)acetamide
TypeSmall organic molecule
Emp. Form.C22H21ClN2O3S
Mol. Mass.428.932
SMILESCc1ccc(cc1)N(CC(=O)Nc1cccc(Cl)c1C)S(=O)(=O)c1ccccc1