Reaction Details
TargetCytochrome P450 2C19
LigandBDBM50410623
Substrate/Competitorn/a
Meas. Tech.ChEMBL_326551 (CHEMBL859750)
IC50 50±n/a nM
Citation Quattropani, ADorbais, JCovini, DPittet, PAColovray, VThomas, RJCoxhead, RHalazy, SScheer, AMissotten, MAyala, GBradshaw, CDe Raemy-Schenk, AMNichols, ACirillo, RTos, EGGiachetti, CGolzio, LMarinelli, PChurch, DJBarberis, CChollet, ASchwarz, MK Discovery and development of a new class of potent, selective, orally active oxytocin receptor antagonists. J Med Chem48:7882-905 (2005) 
 
Cytochrome P450 2C19
Name:Cytochrome P450 2C19
Type:Enzyme
Mol. Mass.:55935.47
Organism:Homo sapiens (Human)
Description:P33261
Residue:490
BDBM50410623
NameBDBM50410623
Synonyms:CHEMBL2113179
TypeSmall organic molecule
Emp. Form.C25H23ClN4O5S
Mol. Mass.526.992
SMILESOCCCc1ccc(cc1)S(=O)(=O)N(CC(=O)N\N=C1/C(=O)Nc2ccccc12)c1ccc(Cl)cc1