Reaction Details
TargetOxytocin receptor
LigandBDBM50410632
Substrate/Competitorn/a
Meas. Tech.ChEMBL_326537 (CHEMBL863355)
Ki 64±n/a nM
Citation Quattropani, ADorbais, JCovini, DPittet, PAColovray, VThomas, RJCoxhead, RHalazy, SScheer, AMissotten, MAyala, GBradshaw, CDe Raemy-Schenk, AMNichols, ACirillo, RTos, EGGiachetti, CGolzio, LMarinelli, PChurch, DJBarberis, CChollet, ASchwarz, MK Discovery and development of a new class of potent, selective, orally active oxytocin receptor antagonists. J Med Chem48:7882-905 (2005) 
 
Oxytocin receptor
Name:Oxytocin receptor
Type:Enzyme Catalytic Domain
Mol. Mass.:42793.26
Organism:Homo sapiens (Human)
Description:Oxytocin OXTR HEK293::B2R9L7
Residue:389
BDBM50410632
NameBDBM50410632
Synonyms:CHEMBL2113202
TypeSmall organic molecule
Emp. Form.C23H20ClN5O5S
Mol. Mass.513.953
SMILESCCOc1ccc(cc1)S(=O)(=O)N(CC(=O)NN=C1C(=O)Nc2ccncc12)c1ccc(Cl)cc1